{"text_format":"1","workbook":"xlsx","n_sheets":6,"sheets":["version","Audit cover page","Quality audit grid","Photos","Quality audit CAP","scoring sheet"],"not_rendered":{"charts":1,"images":62,"macros":1,"external_links":5,"defined_names":102,"comments":3,"pivot_tables":0},"unopened":[],"bounds":{"document_bytes":16777216,"sheet_cells":100000,"rows_first":2000,"rows_last":500,"rows_between":2000,"halvings":0,"cell_chars":16384,"cell_head_chars":4096},"cells_cut":0,"cells_raw":0,"read":"whole","date_system":"1900"}

{"sheet":"version","index":0,"n_rows":20,"n_cols":5,"rows_kept":20,"cut":false,"hidden":false,"merged":[[15,3,15,4],[16,3,16,4],[17,3,17,4],[18,3,18,4],[19,3,19,4],[11,2,11,4],[12,1,12,4],[13,1,13,4],[14,3,14,4],[1,1,3,1],[1,2,3,2],[1,3,1,4],[2,3,3,4],[5,2,5,4],[6,1,6,4]]}
[]
[null,"                                        ","ADEO Quality system audit grid","QUA_CORP_SOUR_R_3.2.1 "]
[null,null,null,"Version : 4"]
[]
[]
[null,"Level of confidentiality","☒ Internal                                                                 ☒ External"]
[null,"Validation flow"]
[null,null,"Position","Validation date","Signature"]
[null,"Editor","Quality Manager","2019-12-20"]
[null,"checker","Quality Manager","2019-12-20","Xiaobing Guo \n\n\nJacky Jiang\n\n\n\n\n\n\n"]
[null,"Approbator","Quality Platform Leader ","2019-12-20","Richie Permal"]
[null,"List of diffusion","ALL ADEO AND PLATFORM Community"]
[]
[null,"Process version history"]
[null,"Version","Application Date","Comments"]
[null,0,"2016-10-05","Initialization"]
[null,1,"2016-11-22","improvement"]
[null,2,"2016-12-27","improvement following first feedbacks"]
[null,3,"2017-01-12","improvements"]
[null,4,"2019-12-20","major updates: new chapters, mixed chapters, deleted ones"]

{"sheet":"Audit cover page","index":1,"n_rows":74,"n_cols":5,"rows_kept":74,"cut":false,"hidden":false,"merged":[[73,0,80,3],[0,1,2,1],[0,2,2,2],[0,3,0,4],[1,3,2,4],[19,1,19,4],[6,1,8,4],[12,3,13,3],[12,4,13,4],[15,3,16,3],[15,4,16,4],[33,1,33,4],[20,1,20,2],[21,1,21,2],[22,1,22,2],[23,1,23,2],[24,1,24,2],[25,1,25,2],[26,1,26,2],[27,1,27,2],[28,1,28,2],[29,1,29,2],[30,1,30,2],[44,1,44,4],[45,1,49,4],[52,1,52,4],[53,1,71,4],[34,1,34,2],[35,1,35,2],[35,4,39,4],[36,1,36,2],[37,1,37,2],[38,1,38,2],[39,1,39,2]]}
[null,"                                        ","ADEO Quality system audit grid","QUA_CORP_SOUR_R_3.2.1 "]
[null,null,null,"Version : 4\nPage 1/3"]
[]
[]
[]
[]
[null,"Qualification Audit Report"]
[]
[]
[]
[]
[null,"Report number/ Номер отчета :","QA_ООО ПОЛИПЛАСТ_11.08.2020","Factory name/Название предприятия :","ООО ПОЛИПЛАСТ"]
[null,"Revision/Версия :","rev2","Factory address/Адрес предприятия : ","г.Краснодар, х.Ленина, МТФ №1, отд.7 "]
[null,"Audit date/Дата аудита :","11.08.2020"]
[null,"Purpose of the visit/Цель визита :","Re-audit","GPS coordinates/Координаты GPS :","45.026610, 39.188079"]
[null,"Auditor name and company/ Название компании и имя аудитора :","Konstantin Kopotilov","Products/ Продукция : ","ПАНЕЛЬ ПВХ, ПРОФИЛЬ, УГОЛ"]
[null,null,"AO \"SGS Vostok Limited\""]
[null,"Atlas code/ Код атласа",null,"Number of employees/Количество сотрудников :"]
[null,null,null,null,12]
[null,"Participants/Участники"]
[null,"Name/ Имя",null,"Function/Должность","Company/Компания"]
[null,"Калинин Денис Валентинович",null,"Директор","ООО \"Полипласт\""]
[null,"Калинин Игорь Олегович",null,"Начальник цеха","ООО \"Полипласт\""]
[null,"Евдокимова Юлия Анатольевна",null,"Специалист по СМК","ООО \"Полипласт\""]
[null,"Некрасова Любовь Федоровна",null,"Главный бухгалтер","ООО \"Полипласт\""]
[]
[]
[]
[]
[]
{"$rows_left_out":45}
{"sheet":"Quality audit grid","index":2,"n_rows":83,"n_cols":10,"rows_kept":83,"cut":false,"hidden":false,"merged":[[82,0,88,2],[0,8,1,9],[2,8,2,9],[0,2,2,7],[0,0,2,1],[7,6,8,6],[7,2,8,2],[7,0,8,0],[7,1,8,1],[7,5,8,5]]}
[null,null,"Quality System Audit Grid ",null,null,null,null,null,"d"]
[]
[null,null,null,null,null,null,null,null,"Version : 1\nPage 1 /2"]
["Legend"]
[null,"Minor question"]
[null,"Major question"]
[]
["Ref/ Ссылка","Requirement/ Требование","SCORE/ОЦЕНКА","Comments/Findings/Комментарии/Несоответствия",null,"Expected deliverable/Ожидаемые свидетельства закрытия несоответствий","Deadline/Дата","Comments on follow up 1/ Комментарии по первой проверке","Comments on follow up 2/ Комментарии по второй проверке","Comments on follow up 3…/ Комментарии по третьей проверке…"]
[null,null,null,{"$f":"\"Remaining Questions: \"&COUNTBLANK(D10:D82)-22","v":"Remaining Questions: 0"},null,null,null,"indicate follow up date here/ укажите здесь дату follow up аудита","indicate follow up date here/ укажите здесь дату follow up аудита","indicate follow up date here/ укажите здесь дату follow up аудита"]
[1,"Quality Management/ менеджмент качества"]
["1.1","Quality Management System/Система менеджмента качества"]
["1.1.1","Company organization\nThe top management shall ensure that employees are aware of their responsibilities. /                                                                                                                                     Структура организации                                                                                                                                                                                                                                       Высшее руководство обязуется следить за тем, чтобы сотрудники были осведомлены о своих обязанностях.\nПостановка задач для ответственного персонала должна быть указана в схемах организационной структуры и/или в должностных инструкциях.\nThe assignment of tasks to the dedicated personnel has to be written through organigrams and/or job descriptions.  ","Compliant","Высшее руководство берет на себя обязательства следить за тем, чтобы сотрудники были осведомлены о своих обязанностях. Постановка задач для ответственного персонала определена в схеме организационной структуры предприятия. Работники осведомлены об их обязанностях. Должностные инструкции работников и организационная схема продемонстрированы.",{"$f":"IF(C12=\"Not Compliant\",2,IF(C12=\"Partially Compliant\",1,IF(C12=\"Compliant\",0,IF(C12=\"N.A.\",\"NA\",FALSE))))","v":0}]
["1.1.2","Quality Department Management\nAt least, one person shall be appointed for daily quality management. \nThis person is trained.\nThe Quality Dept. is independent of production, and has authority, means and own objectives /                                                                                                                                                     Управление Качеством\nДля управления качеством на ежедневной основе назначается по крайней мере одно ответственное лицо.\nДанное ответственое лицо обучено.\nОтдел контроля качества является независимым от производства и обладает полномочиями, средствами и собственными целями","Compliant","Вопросы управления качеством распределены между директором, заместителем директора и специалистом по СМК. Предоставлена организационная схема, должностные инструкции.",{"$f":"IF(C13=\"Not Compliant\",4,IF(C13=\"Partially Compliant\",2,IF(C13=\"Compliant\",0,FALSE)))","v":0}," "]
["1.1.3","Objectives / KPI\nThe contents of the quality strategy shall have been broken down into specific objectives for the related departments : \n- The objectives are concrete and measurable (SMART)\n- Some KPI and dashboards to measure quality performance must be provided during the audit\n- KPI are communicated, understood and monitored\n- The KPIs are analyzed and followed-up according to factory defined procedure /                                                                                                                       Цели / КПЭ (Ключевые показатели эффективности) \nСодержание стратегии качества должно быть разделено на конкретные задачи для соответствующих отделов:\n- Цели являются конкретными и измеримыми\n- Некоторые ключевые показатели эффективности и информационные панели для измерения показателей качества должны быть предоставлены во время аудита.\n- КПЭ известны и понятны\n- КПЭ выполняются","Compliant","Предоставлен документ \"Цели в области качества ООО \"Полипласт\" на 2020 год.\" ",{"$f":"IF(C14=\"Not Compliant\",2,IF(C14=\"Partially Compliant\",1,IF(C14=\"Compliant\",0,IF(C14=\"N.A.\",\"NA\",FALSE))))","v":0}]
["1.1.4","Internal quality audits\nInternal quality audits shall be conducted according to an agreed plan .\nScope and frequency shall be determined by supplier's quality management system\nAuditors shall be trained for audits and independant from the audited department. \nA corrective action plan is managed, and actions are verified. /                                                                                                                           Внутренние аудиты по качеству\nВнутренние аудиты по качеству должны проводиться в соответствии с согласованным планом.\nОбъем и частота проведения аудита должны определяться системой менеджмента качества поставщика.\nАудиторы должны быть обучены проведению аудитов и быть независимыми от проверяемого отдела.\nПрисутствует план корректирующих действий и выполняется контроль выполнения","Compliant","Процедура проведения внутренних аудитов описана в Руководстве по качеству СМК, а так же в Положении о внутреннем аудиторе ООО \"Полипласт\". Предоставлен Приказ о назначении внутреннего аудитора СМК, сертификаты об обучении, годовой график внутренних аудитов, отчеты о проведенных аудитах."]
["1.1.5","Non conformity management\nA non conformity management procedure shall be clearly documented and followed, to prevent further occurrence of non-conformity. It shall be applicable to any kind of non conformity (internal, supplier, customer complaint).\n\nThe procedure shall include at least : \n- Containment action (identification, isolation) \n- Reaction rules such as rejection, segregation, acceptance by concession, alternative use...\n- Root cause analysis\n- Internal problems solving tools (non conformity report, 8D, QRQC, PDCA...)\n- Responsibilities and deadline for corrective actions\n- Records\n- Performance and effectiveness of the corrective actions \n- Performance and effectiveness of the corrective actions /                                                                                                                                               Управление несоответствиями                                                                                                                                                                                               Процедура управления несоответствиями должна быть четко документирована и соблюдаться, чтобы предотвратить их дальнейшее возникновение. Данная процедура применяется к любому виду несоответствия (внутренний, поставщик, жалоба потребителя).\n\nДанная процедура должна включать как минимум:\n- сдерживающее действие (идентификация, изоляция)\n- Правила реагирования при  отказе, изоляции, приеме по уступке, альтернативному использованию.\n- Анализ причин\n-  Инструменты решения внутренних проблем (отчет о несоответствии, 8D (Eight Disciplines Problem Solving - методика восьмиэтапного выявления и устранения проблем, QRQC (Quick Response Quality Control - Оперативный контроль качества (ОКК), PDCA (Plan-Do-Check-Act - Планирование-Действие-Проверка-Корректировка...)\n- Ответственные лица и срок реализации корректирующих действий\n- Записи\n- Выполнение и эффективность корректирующих действий                   ","Compliant","Процедура управления несоответствиями описана в Руководстве по качеству СМК. В электронном виде ведется база анализа рисков и корректирующих действий. Регистрация всех выявленных несоответствий и контроль выполнения корректирующих действий выполняется. "]
["1.1.6","Continuous improvement/RETEX and Preventive actions                                 \nThe supplier shall be able to determine if there are needs or opportunities that shall be addressed as part of continuous improvement, functions of the results of analysis, evaluations or reviews. /                                                                                                         Постоянное улучшение / RETEX и Профилактические мероприятия                             \nПоставщик должен быть в состоянии определить, есть ли потребности или возможности, которые должны рассматриваться как часть постоянного улучшения, функций результатов анализа, оценок или проверок.","Compliant","Поставщик анализирует потребности и возможности, которые  рассматриваются, как часть постоянного улучшения. ",{"$f":"IF(C17=\"Not Compliant\",2,IF(C17=\"Partially Compliant\",1,IF(C17=\"Compliant\",0,IF(C17=\"N.A.\",\"NA\",FALSE))))","v":0}]
["1.1.7","Traceability\nFor a given finished product, the supplier shall be able to identify the batches numbers/PO number/PO date of the critical raw material/ components, as long as it can be tracked back to the source. /                                                                 Прослеживаемость\nДля данного готового продукта поставщик должен иметь возможность идентифицировать номера партий/ номер заказа/дата заказа критического сырья/ компонентов, при условии, что он может быть отслежен до источника.","Compliant","Организация имеет возможность проследить, сырье и материалы каких поставщиков использовались в каждой партии готовой продукции, так как материалы поставщиков не смешиваются, вся информация по закупкам документируется. Маркировка готовой продукции содержит точную дату производства.",{"$f":"IF(C18=\"Not Compliant\",4,IF(C18=\"Partially Compliant\",2,IF(C18=\"Compliant\",0,FALSE)))","v":0}]
["1.2","Quality documentation/документация по управлению качеством"]
["1.2.1","Documentation formalization\nThe quality system shall be documented and implemented.\nRules concerning documents validation and diffusion are established.\n\nProcess, instructions, records are:\n-Written and available, when their absence can involve a risk for the quality\n-Identified\n-With revision status and up-to-date/                                                                                                                                                                Оформление документации\nСистема качества должна быть документирована и внедрена.\nУстановлены правила утверждения и управления документацией.\n\nПроцесс, инструкции, записи:\n- В письменном виде и доступны в случае, когда их отсутствие может быть сопряжено (может влиять) с риском для качества\n- Идентифицированы\n- Со статусом редакции документа и актуальны","Compliant","Система качества документирована и внедрена. Предоставлены документы СМК Руководство по качеству, Политика в области качества, Цели в области качества, Инструкция по упаковке продукции, Положение о внутреннем аудиторе, Положение об обучении персонала, Технологический регламент производства изделий из ПВХ, Правила утверждения и управления документацией определены в Руководстве по качеству. Предоставленные документы и записи идентифицированы и актуальны."]
["1.2.2","Archiving & availability\nAll relevant documents shall be safely stored and archived during a period defined by the regulation (or 1 year in case of no regulation)\nThe applicable documents shall be easily and quickly reachable for authorized personnel.  /                                                                                                                                    Архивирование и доступность\nВсе соответствующие документы должны надежно храниться и архивироваться в течение периода, определенного регламентом (или спустя 1 год в случае отсутствия регламента)\nК соответствующим документам должен быть обеспечен легкий и быстрый доступ для уполномоченного персонала       ","Compliant","К соответствующим документам  обеспечен легкий и быстрый доступ для уполномоченного персонала."]
["1.3","Human Ressources/ Персонал"]
["1.3.1","Skill matrix\nA list with employees names, operations/functions for the people working in the workshop shall exist and be periodically updated.\nThis matrix shall be available for quality and production./                                                                                                                           Матрица навыков\nСписок с именами сотрудников,  операциями / функциями для людей, работающих в мастерской, должен существовать и периодически обновляться.\nЭта матрица должна быть доступна для отдела качества и производства.","Compliant","Функции и профессиональные компетенции определены в должностных инструкциях ответственных лиц. Матрица ответственности работников ООО \"Полипласт\" является частью руководства по качеству.",0]
["1.3.2","Training plan & assessment\nThe company shall have a documented training plan and assessment.\nThese programs shall include:\n- training contents\n- training frequency\n- list of attendants\n- Name of qualified trainer/tutor.\n- An update frequency\n\nNote : it shall be applied even for temporary people./                                                                                                                                                                                                                                План обучения и оценка\nОрганизация должна иметь документированный план обучения и оценки.\nДанные программы должны включать:\n- содержание программы обучения\n- периодичность обучения\n- список присутствующих\n- Имя квалифицированного руководителя обучения/преподавателя.\n- Периодичность обновления\n\nПримечание: применимо даже для временных сотрудников.\n","Compliant","Предоставлено Положение об обучении персонала ООО \"Полипласт\". Планирование и оценка результатов проведенного обучения выполняется персонально для каждого работника в личных книжках обучения работников.",0]
["1.4","Testing management/ Управление испытаниями"]
["1.4.1","Subcontracted testing \nIf some tests are subcontracted, a dedicated contract/order shall be in place with the external laboratory.\nThe tests needed must be clearly defined in the order to the lab.\nThe test reports shall be available and the company shall demonstrate that the results are relevant /                                                                                                                     Испытания, проводимые внешними лабораториями\nЕсли некоторые испытания выполняются подрядными лабораториями, должен действовать специальный договор/заказ с внешней лабораторией.\nНеобходимые испытания должны быть четко определены в заказе\\заявке, направляемом в лабораторию.\nОтчеты об испытаниях должны быть доступны и организация должна продемонстрировать, что результаты являются актуальными","Compliant","Предоставлено информационное письмо №1595 от 18.07.2019 г. - продукция не подлежит обязательной сертификации. Компания привлекает подрядные лаборатории для проведения добровольной сертификации на соответствие требованиям пожарной безопасности. Предоставлен договор №11 от 14.04.2020 и Сертификат соответствия и протоколы сертификационных испытаний."]
["1.4.2","In-house testing\nIn case of the tests are not subcontracted the company shall be able to demonstrate that the tests are performed according to the control plan\nAn internal test management procedure is available and applied. /                                                                                                                                                                                                                                                          Собственные испытания\nВ случае, если испытания не проводятся субподрядными лабораториями, компания должна продемонстрировать, что испытания проводятся в соответствии с планом контроля. \nВнутренняя процедура испытаний  доступна и применяется.","Compliant","Контроль качества продукции выполняется ежедневно. Результаты испытаний регистрируются в журнале контроля качества готовой продукции. Внутренние испытания проводятся в соответствии с требованиями ТУ 22.23.19-001-96082860-2017 \"Изделия профильные поливинилхлоридные\"."]
["1.4.3","In-house testing technicians\nFor the tests requiring specific skills, the technicians must be qualified and trained/tested regularly by test reproducibility\nThe factory should ensure the test performed internally is relevant and reliable, random repeat test should be performed for assuring the reproducibility of the tests  /                                                                                                                                                       Внутренние специалисты по тестированию\nДля тестов, требующих определенных навыков, технические специалисты должны быть квалифицированы и регулярно обучаться / тестироваться регулярными тестами. \nЗавод должен убедиться в том, что проведенное внутреннее испытание является значимым и надежным, следует провести случайное повторное испытание для обеспечения регулярных испытаний.","N.A.","Специальные навыки не требуются."]
[2,"Product Development/ Разработка продукта"]
["2.1","Product development process/ Процесс разработки продукта"]
{"$rows_left_out":54}
{"sheet":"Photos","index":3,"n_rows":161,"n_cols":13,"rows_kept":161,"cut":false,"hidden":false,"merged":[[4,3,4,9],[4,11,4,12],[0,1,2,2],[0,10,1,12],[2,10,2,12],[0,3,2,9]]}
[null,null,null,"Quality System Audit Grid Grid",null,null,null,null,null,null,"QUA_CORP_SOUR_R_3.2.1"]
[]
[null,null,null,null,null,null,null,null,null,null,"Version : 1\nPage 1 /2"]
[]
[null,null,"Factory name/Название предприятия",{"$f":"'Audit cover page'!E12","v":"ООО ПОЛИПЛАСТ"},null,null,null,null,null,null,"Auditor/Аудитор",{"$f":"'Audit cover page'!C16","v":"Konstantin Kopotilov"}]
[]
[]
[]
[]
[]
[]
[]
[]
[]
[]
[null,"Фасад здания",null,null,"Цели в области качества",null,null,"Политика в области качества",null,null,"Технические условия"]
[null,null,null,1,null,null,2,null,null,3,null,null,4]
[]
[]
[]
[]
[]
[]
[]
[]
[]
[]
[null,"Зона хранения компонентов",null,null,"Маркировка сырья",null,null,"Зона хранения вторсырья",null,null,"Производственный цех"]
[null,null,null,{"$f":"D17+4","v":5},null,null,{"$f":"G17+4","v":6},null,null,{"$f":"J17+4","v":7},null,null,{"$f":"M17+4","v":8}]
[]
{"$rows_left_out":132}
{"sheet":"Quality audit CAP","index":4,"n_rows":20,"n_cols":7,"rows_kept":20,"cut":false,"hidden":false,"merged":[[5,0,5,6],[7,3,7,5],[8,3,8,5],[1,4,2,6],[3,4,3,6],[1,1,3,3]]}
[]
[null,"Quality System Audit Grid Grid",null,null,"QUA_CORP_SOUR_R_3.2.1"]
[]
[null,null,null,null,"Version : 1\nPage 1 /2"]
[]
["Corrective Action Plan/План корректирующих действий"]
[]
["Report number/Номер отчета :","QA_ООО ПОЛИПЛАСТ_11.08.2020","Purpose of the visit /Цель визита:","Qualification Audit"]
["Factory name/ Название предприятия :","ООО ПОЛИПЛАСТ","Factory address/Адрес предприятия :","г.Краснодар, х.Ленина, МТФ №1, отд.7 "]
[]
["Ref/Ссылка\n(question number in the qualification audit grid)/(номер вопроса в чек-листе)","Comments/Комментарии","Expected deliverable/Ожидаемые свидетельства закрытия несоответствий","Corrective action/Корректирующие действия","Responsible/Ответственный","Deadline/Дата","Photo/Фото"]
[]
[]
[]
[]
[]
[]
["Auditor Name: /Имя, фамилия аудитора:",null,"Supplier Representative Name: / Имя, фамилия представителя от поставщика"]
["Signature:/ Подпись:",null,"Signature:/ Подпись: "]
["Date:/Дата:",null,"Date:/Дата:"]

{"sheet":"scoring sheet","index":5,"n_rows":25,"n_cols":12,"rows_kept":25,"cut":false,"hidden":true,"merged":[[2,6,3,6]]}
[null,null,null,null,null,null,null,null,"Major questions","Score Major","Standard questions","Score standard"]
["Scoring","grades","in %",null,null,"Final Score",{"$f":"(1-SUM('Quality audit grid'!E12:E82)/(11*J5+(41-G5)*L5))*100","v":100},null,null,null,"N.A."]
[95,"A",{"$f":"\"over \"&A3&\" %\"","v":"over 95 %"},null,null,"Grade",{"$f":"IF(D15>=4,\"D\",IF(G2<80,\"D\",IF(D15>0,\"C\",IF(G2>=95,\"A\",IF(G2>=90,\"B\",IF(G2>=80,\"C\"))))))","v":"A"},null,"Compliant",0,"Compliant",0]
[90,"B",{"$f":"\"over \"&A4&\"% and lower than \"&A3&\"%\"","v":"over 90% and lower than 95%"},null,null,null,null,null,"Partially Compliant",2,"Partially Compliant",1]
[80,"C",{"$f":"\"over \"&A5&\"% and lower than \"&A4&\"%\"","v":"over 80% and lower than 90%"},null,null,"NA count",{"$f":"SUM(G9:G13)","v":3},null,"Not Compliant",4,"Not Compliant",2]
[null,"D",{"$f":"\"lower than \"&A5&\"% \nor more than 4 major failures on major questions\"","v":"lower than 80% \nor more than 4 major failures on major questions"}]
[]
[null,null,"Chapters","%","Major","Standard","NA count","sum","best possible score","worst possible score"]
[null,1,"Quality Management ",{"$f":"(1-H9/J9)","v":1},4,10,{"$f":"COUNTIF('Quality audit grid'!E12:E28,\"NA\")","v":0},{"$f":"SUM('Quality audit grid'!E12:E28)","v":0},0,{"$f":"$J$5*E9+(F9-G9)*$L$5","v":36}]
[null,2,"Product Development",{"$f":"(1-H10/J10)","v":1},2,9,{"$f":"COUNTIF('Quality audit grid'!E31:E42,\"NA\")","v":0},{"$f":"SUM('Quality audit grid'!E31:E42)","v":0},0,{"$f":"$J$5*E10+(F10-G10)*$L$5","v":26}]
[null,3,"Purchasing and scheduling",{"$f":"(1-H11/J11)","v":1},1,4,{"$f":"COUNTIF('Quality audit grid'!E46:E51,\"NA\")","v":0},{"$f":"SUM('Quality audit grid'!E46:E51)","v":0},0,12]
[null,4,"Raw material and components",{"$f":"(1-H12/J12)","v":1},1,5,{"$f":"COUNTIF('Quality audit grid'!E54:E59,\"NA\")","v":0},{"$f":"SUM('Quality audit grid'!E54:E59)","v":0},0,14]
[null,5,"Manufacturing process",{"$f":"(1-H13/J13)","v":1},2,15,{"$f":"COUNTIF('Quality audit grid'!E62:E82,\"NA\")","v":3},{"$f":"SUM('Quality audit grid'!E62:E82)","v":0},0,32]
[]
[null,null,"Qty of Majors",{"$f":"COUNTIF('Quality audit grid'!$E$12:$E$82,\"4\")","v":0}]
[]
[]
[]
[]
[]
[null,null,null,{"$f":"VLOOKUP(12,D23:E25,2)","v":"A"}]
[]
[null,null,null,10,"A"]
[null,null,null,20,"B"]
[null,null,null,30,"C"]